Year,Jurisdiction,Jur_Name,Parcel_ID,Account,Ownership_Sequence,Owner_Id,Owner_Prefix,Name,Careof,Street,Street_Overflow,City,State,Zip5,Zip4,Location_Code,Jur 1,Jur 2,Jur 3,Jur 4,Jur 5,Jur 6,Jur 7,Jur 8,Jur 9,Jur 10,Jur 11,Jur 12,Is_Exempt,Prop_Street_Number,Prop_Street,Prop_Street_Dir,Prop_City,Prop_State,Prop_Zip5,Prop_Zip4,Map1,Map2,Is_Protested,Has_Hs_Link,Primary_Category_Code,Secondary_Category_Code,Third_Category_Code,DBA,Interest,Ceiling_Year,Ceiling_Tax,Homestead_Code,Agent_Code,Agent_Name,Acres,Legal1,Legal2,Legal3,Legal4,Mortgage_Code,Lease_Number,Lease_Name,Operator_Name,RRC_Number,Interest_Type,Land_Hs,Land_Nhs,Land_Productivity_Market,Land_1d1,Land_1d,Land_Timber,Personal_Hs,Personal_Nhs,Market_Value,Net_Taxable_Value,State_Homestead,State_Mandated_Over65,State_Mandated_Disabled,Optional65,Local_Disabled,Road_Homestead,Disabled_Veteran,New_Personal_Hs,New_Personal_Nhs,Improvement_Hs,New_Improvement_Hs,Improvement_Nhs,New_Improvement_Nhs,Is_Owner_Confidential,Local_Discount,Has_Abatement,Has_Miscellaneous_Exemption,Abatement_Value,Mineral_Freeport_Value,Mineral_Unknown_Value
2021,00,NACOGDOCHES CAD,25,01-001-0013-000000,1,24,R,POSKEY VERT,,2123 COUNTY ROAD 724,,NACOGDOCHES,TX,75964,2448,284,00,01,36,50,64,,,,,,,,False,2123,COUNTY ROAD 724,,NAC COUNTY,TX,,,1208,001,False,False,D1T,E1,,,1.000000,0,0.00,H,,,18.8500,A 1 J I ACOSTA P 13,,,,,,,,,,4320,0,77110,0,0,3250,0,0,134350,60490,0,0,0,0,0,0,0,0,0,52920,0,0,0,False,0,False,False,0,0,0
2021,00,NACOGDOCHES CAD,63,01-001-0042-020000,1,43542,R,GONZALES FELIX ANTHONY,,2706 GREENBRIAR ST,,DICKINSON,TX,77539,4617,284,00,01,36,50,64,,,,,,,,False,,,,NAC COUNTY,TX,,,1208,001,False,False,D1A,,,,1.000000,0,0.00,,,,56.0200,A-1 J I ACOSTA P 42-2,,,,,,,,,,0,0,161340,2800,0,5100,0,0,161340,7900,0,0,0,0,0,0,0,0,0,0,0,0,0,False,0,False,False,0,0,0
2021,00,NACOGDOCHES CAD,64,01-001-0043-000000,1,74237,R,VARDEMAN MELANIE MONTES,,5435 W STATE HIGHWAY 7,,NACOGDOCHES,TX,75964,8037,284,00,01,36,50,64,,,,,,,,False,,FM 2782,,NAC COUNTY,TX,,,1208,001,False,False,D1A,,,,1.000000,0,0.00,,,,72.7800,A-1 J I ACOSTA P 43 &,A-199 J M ESPARZA P 40,,,,,,,,,0,0,220090,7280,0,0,0,0,220090,7280,0,0,0,0,0,0,0,0,0,0,0,0,0,False,0,False,False,0,0,0
2021,00,NACOGDOCHES CAD,77,01-001-0051-030000,1,68099,R,PERKINS JARROD,,4786 COUNTY ROAD 620,,NACOGDOCHES,TX,75964,,284,00,01,36,50,64,,,,,,,,False,4786,COUNTY ROAD 620,,NAC COUNTY,TX,,,1208,001,False,False,A2R,,,,1.000000,0,0.00,,,,1.6400,A-1 J I ACOSTA P 51-3,30X54 LONE STAR/OAK CREEK M/H,NTA1498351 --  OC051017021A,,,,,,,,0,11810,0,0,0,0,0,0,34900,34900,0,0,0,0,0,0,0,0,0,0,0,23090,0,False,0,False,False,0,0,0
2021,00,NACOGDOCHES CAD,81,01-001-0053-000000,1,63657,R,GARCIA ONECIMO & MA EMMA,,303 COUNTY ROAD 621,,NACOGDOCHES,TX,75964,8578,284,00,01,36,50,64,,,,,,,,False,303,COUNTY ROAD 621,,NAC COUNTY,TX,,,1210,001,False,False,D1A,E2R,D2,,1.000000,0,0.00,H,,,9.2500,A-1 J I ACOSTA P 53,14X60 FLEETWOOD VOGUE,28X48 AMERICAN HOMESTAR,PFS0754619    AH010213276B,,,,,,,6480,0,53460,830,0,0,0,0,88330,35700,0,0,0,0,0,0,0,0,0,24190,0,4200,0,False,0,False,False,0,0,0
2021,00,NACOGDOCHES CAD,99,01-001-0063-000000,1,92,R,SPRADLEY LAWRENCE,,5710 GLASGOW LN,,BEAUMONT,TX,77706,2619,284,00,01,36,50,64,,,,,,,,False,,COUNTY ROAD 635,,NAC COUNTY,TX,,,1210,001,False,False,D1M,,D2,,1.000000,0,0.00,,,,51.2000,A-1 J I ACOSTA P 63,,,,,,,,,,0,0,147460,1100,0,10380,0,0,170320,34340,0,0,0,0,0,0,0,0,0,0,0,22860,0,False,0,False,False,0,0,0
2021,00,NACOGDOCHES CAD,104,01-001-0066-020000,1,98,R,GRIFFIN STEPHEN,,6725 FM 2782,,NACOGDOCHES,TX,75964,8777,284,00,01,36,50,64,,,,,,,,False,6725,FM 2782,,NAC COUNTY,TX,,,1208,001,False,False,D1T,E1,,,1.000000,0,0.00,H,,,16.1000,A-1 J I ACOSTA P 66-2,,,,,,,,,,5040,0,76100,1510,0,0,0,0,105030,30440,0,0,0,0,0,0,0,0,0,23890,0,0,0,False,0,False,False,0,0,0
2021,00,NACOGDOCHES CAD,110,01-002-0003-010000,1,103,R,LOWRY GERALD L,,289 SPRING LN,,NACOGDOCHES,TX,75964,5456,284,00,01,36,50,64,,,,,,,,False,289,SPRING LN,,NAC COUNTY,TX,,,1010,002,False,False,D1T,E1,,,1.000000,0,0.00,H,,,38.4380,A-2 J D ACOSTA P-3-1,,,,,,,,,,2210,5190,126140,0,0,10370,0,0,237730,121960,0,0,0,0,0,0,0,0,0,104190,0,0,0,False,0,False,False,0,0,0
2021,00,NACOGDOCHES CAD,113,01-002-0003-030000,1,106,R,CHRISTIAN JOHNNY & MARLA,,127 SHADY TRAIL,,NACOGDOCHES,TX,75964,1393,284,00,01,36,50,64,,,,,,,,False,,COUNTY ROAD 711,,NAC COUNTY,TX,,,1010,002,False,False,D1T,,,,1.000000,0,0.00,,,,21.1200,A-2 J D ACOSTA P-3-3,,,,,,,,,,0,0,91240,0,0,6000,0,0,91240,6000,0,0,0,0,0,0,0,0,0,0,0,0,0,False,0,False,False,0,0,0
2021,00,NACOGDOCHES CAD,114,01-002-0003-040000,1,107,R,STRIPLING ADAM CHRISTOPHER,,136 SHADY TRL,,NACOGDOCHES,TX,75964,5454,284,00,01,36,50,64,,,,,,,,False,136,SHADY TRL,,NAC COUNTY,TX,,,1010,002,False,False,A2P,,,,1.000000,0,0.00,H,DNM,DO NOT MAIL,2.3100,A-2 J D ACOSTA P-3-4,14X51 CAMERON MFG HOME,TXS0551416 -- CT9120E,,,,,,,,19960,0,0,0,0,0,0,0,22600,22600,0,0,0,0,0,0,0,0,0,2640,0,0,0,False,0,False,False,0,0,0
2021,00,NACOGDOCHES CAD,139,01-003-0003-000000,1,62509,R,TUBBE CASEY,,PO BOX 301,,CUSHING,TX,75760,0301,210,00,01,31,50,62,,,,,,,,False,,COUNTY ROAD 970,,NAC COUNTY,TX,,,0406,003,False,False,D1T,,,,1.000000,0,0.00,,,,2.3100,A-3 C AGUILERA P-3,,,,,,,,,,0,0,11640,0,0,420,0,0,11640,420,0,0,0,0,0,0,0,0,0,0,0,0,0,False,0,False,False,0,0,0
2021,00,NACOGDOCHES CAD,141,01-003-0003-010000,1,62509,R,TUBBE CASEY,,PO BOX 301,,CUSHING,TX,75760,0301,210,00,01,31,50,62,,,,,,,,False,,COUNTY ROAD 871,,NAC COUNTY,TX,,,0406,003,False,False,D1T,,,,1.000000,0,0.00,,,,4.6600,A-3 C AGUILERA P-3-1,,,,,,,,,,0,0,23490,0,0,850,0,0,23490,850,0,0,0,0,0,0,0,0,0,0,0,0,0,False,0,False,False,0,0,0
2021,00,NACOGDOCHES CAD,152,01-003-0009-000000,1,78088,R,LEUTWYLER DUSTIN & DIANA,,536 COUNTY ROAD 871,,CUSHING,TX,75760,3767,210,00,01,31,50,62,,,,,,,,False,538,COUNTY ROAD 878,,NAC COUNTY,TX,,,0406,003,False,False,D1T,E2R,,,1.000000,0,0.00,,,,16.4600,A-3 C AQUILERA PS 9 & 11,27X68 CHAMPION COMMONWEALTH II,NTA1801423----020000HA000769A,,1100,,,,,,5040,0,77920,0,0,1330,0,0,170170,93580,0,0,0,0,0,0,0,0,0,87210,0,0,0,False,0,False,False,0,0,0
2021,00,NACOGDOCHES CAD,154,01-003-0010-010000,1,145,R,BIRDWELL KENNETH R,,2878 FM 23 W,,RUSK,TX,75785,5933,210,00,01,31,50,62,,,,,,,,False,,COUNTY ROAD 871,,NAC COUNTY,TX,,,0406,003,False,False,D1T,,,,1.000000,0,0.00,,,,3.6500,A-3 C AGUILERA P-10-1,(J A BIRDWELL ESTATE),,,,,,,,,0,0,21020,0,0,660,0,0,21020,660,0,0,0,0,0,0,0,0,0,0,0,0,0,False,0,False,False,0,0,0
2021,00,NACOGDOCHES CAD,172,01-003-0017-000001,1,665,R,BIRDWELL BRYANT & EDNA,,667 COUNTY ROAD 837,,NACOGDOCHES,TX,75964,2845,210,00,01,31,50,62,,,,,,,,False,,COUNTY ROAD 875,,NAC COUNTY,TX,,,0406,003,False,False,D1T,,,,1.000000,0,0.00,,,,1.7200,A-3 C AGUILERA P-17,(1/6 UND INT IN 10.3 ACRES),,,,,,,,,0,0,12380,0,0,490,0,0,12380,490,0,0,0,0,0,0,0,0,0,0,0,0,0,False,0,False,False,0,0,0
2021,00,NACOGDOCHES CAD,174,01-003-0017-000003,5,77446,R,BIRDWELL BRYANT HAYDEN,,667 COUNTY ROAD 837,,NACOGDOCHES,TX,75964,,210,00,01,31,50,62,,,,,,,,False,,COUNTY ROAD 875,,NAC COUNTY,TX,,,0406,003,False,False,D1T,,,,0.166600,0,0.00,,,,0.2866,A-3 C AGUILERA P-17,,,,,,,,,,0,0,2060,0,0,50,0,0,2060,50,0,0,0,0,0,0,0,0,0,0,0,0,0,False,0,False,False,0,0,0
2021,00,NACOGDOCHES CAD,176,01-003-0017-000005,1,73539,R,HARRIS BRENT/HARRIS ERIC/ C COOPER,CARISSA L COOPER,1648 FM 819,,LUFKIN,TX,75901,2053,210,00,01,31,50,62,,,,,,,,False,,COUNTY ROAD 875,,NAC COUNTY,TX,,,0406,003,False,False,D1T,,,,0.500000,0,0.00,,,,0.8600,A-3 C AGUILERA P-17,(1/6 UND INT IN 10.3 ACRES,OWNED BY BOTH PARTIES),,,,,,,,0,0,6190,0,0,250,0,0,6190,250,0,0,0,0,0,0,0,0,0,0,0,0,0,False,0,False,False,0,0,0
2021,00,NACOGDOCHES CAD,179,01-003-0020-000000,1,127,R,NICHOLS TERRY FULLER,,PO BOX 110,,CUSHING,TX,75760,0110,210,00,01,31,50,62,,,,,,,,False,,COUNTY ROAD 871,,NAC COUNTY,TX,,,0406,003,False,False,D1T,,,,1.000000,0,0.00,,,,59.1000,"A-3 C AGUILERA PS-20,21 & RR",ROW,,,,,,,,,0,0,187220,0,0,12300,0,0,187220,12300,0,0,0,0,0,0,0,0,0,0,0,0,0,False,0,False,False,0,0,0
2021,00,NACOGDOCHES CAD,194,01-003-0031-000000,1,79932,R,LUGIBIHL RICHARD & BARBARA,,2072 COUNTY ROAD 874,,CUSHING,TX,75760,5180,210,00,01,31,50,62,,,,,,,,False,2072,COUNTY ROAD 874,,NAC COUNTY,TX,,,0406,003,False,False,D1A,E,D2,,1.000000,0,0.00,H,,,7.7470,A-3 C AGUILERA PS 31& 32-1,,,,,,,,,,5040,0,34000,670,0,0,0,0,128420,95090,0,0,0,0,0,0,0,0,0,74650,0,14730,0,False,0,False,False,0,0,0
2021,00,NACOGDOCHES CAD,206,01-003-0037-000000,1,194,R,WHITTON RAY,,9805 SHOREVIEW RD,,DALLAS,TX,75238,4305,210,00,01,31,50,62,,,,,,,,False,158,COUNTY ROAD 929,,NAC COUNTY,TX,,,0406,003,False,False,D1T,E2P,,,1.000000,0,0.00,,,,8.3000,A-3 C AGUILERA P-37,14X80 OAKCREEK,,,,,,,,,4320,0,31540,0,0,1330,0,0,39780,9570,0,0,0,0,0,0,0,0,0,3920,0,0,0,False,0,False,False,0,0,0
2021,00,NACOGDOCHES CAD,208,01-003-0039-000000,1,42093,R,NELSON MARY PAULINE,C/O RAY DEES,1751 COUNTY ROAD 874,,CUSHING,TX,75760,5192,210,00,01,31,50,62,,,,,,,,False,1751,COUNTY ROAD 874,,NAC COUNTY,TX,,,0406,003,False,False,A1,,,,1.000000,0,0.00,,,,1.0000,A-3 C AGUILERA P-39,,,,,,,,,,7200,0,0,0,0,0,0,0,112000,112000,0,0,0,0,0,0,0,0,0,104800,0,0,0,False,0,False,False,0,0,0
2021,00,NACOGDOCHES CAD,209,01-003-0040-000000,1,1907,R,TUCKER BILLY & DORTHEA PROPERTIES,C/O THEODORA BUTTS,5656 FAIRFAX DR,,FRISCO,TX,75034,,210,00,01,31,50,62,,,,,,,,False,,COUNTY ROAD 872,,NAC COUNTY,TX,,,0406,003,False,False,D1T,,,,1.000000,0,0.00,,,,48.6000,A-3 C AQUILERA P 40,,,,,,,,,,0,0,174960,0,0,8850,0,0,174960,8850,0,0,0,0,0,0,0,0,0,0,0,0,0,False,0,False,False,0,0,0
2021,00,NACOGDOCHES CAD,214,01-003-0042-030000,1,41872,R,TOWNSEND VANCE GENE II,,4103 GLENWOOD DR,,RICHMOND,TX,77406,9134,210,00,01,31,50,62,,,,,,,,False,2609,COUNTY ROAD 874,,NAC COUNTY,TX,,,0406,003,False,False,D1T,E1,,,1.000000,0,0.00,,,,5.0000,A-3 C AGUILERA P 42-3,,,,,,,,,,5040,0,20160,0,0,730,0,0,30200,10770,0,0,0,0,0,0,0,0,0,5000,0,0,0,False,0,False,False,0,0,0
2021,00,NACOGDOCHES CAD,217,01-003-0044-010000,1,202,R,DYESS DEBORAH JOY,DEBORAH JOY BRIGHT,5372 COUNTY ROAD 348,,BRAZORIA,TX,77422,7245,210,00,01,31,50,62,,,,,,,,False,,COUNTY ROAD 872,,NAC COUNTY,TX,,,0406,003,False,False,D1T,,,,1.000000,0,0.00,,,,10.9000,A-3 C AGUILERA P-44-1,,,,,,,,,,0,0,18840,0,0,1980,0,0,18840,1980,0,0,0,0,0,0,0,0,0,0,0,0,0,False,0,False,False,0,0,0
2021,00,NACOGDOCHES CAD,268,01-004-0028-000000,1,249,R,WILSON TROYIS & MARY,,288 WILSON LOOP,,NACOGDOCHES,TX,75961,8807,280,00,01,36,50,,,,,,,,,False,288,WILSON LOOP,,NAC COUNTY,TX,,,0816,004,False,False,A1,,,,1.000000,0,0.00,H,,,3.5360,A-4 M J ARRIOLA PS-28 &,PRT P 29-2,,,,,,,,,15280,0,0,0,0,0,0,0,211850,211850,0,0,0,0,0,0,0,0,0,196570,0,0,0,False,0,False,False,0,0,0
2021,00,NACOGDOCHES CAD,272,01-004-0031-000000,1,81005,R,PFEIFFER DURRETT ANN HARROP,,2280 PFEIFFER RD,,FREDERICKSBURG,TX,78624,6967,280,00,01,36,50,,,,,,,,,False,3160,COUNTY ROAD 228,,NAC COUNTY,TX,,,0816,004,False,False,D1T,,,,1.000000,0,0.00,,,,232.2000,A-4 M J ARRIOLA P-31,,,,,,,,,,0,0,802490,0,0,39670,0,0,802490,39670,0,0,0,0,0,0,0,0,0,0,0,0,0,False,0,False,False,0,0,0
2021,00,NACOGDOCHES CAD,300,01-005-0007-010000,1,78670,R,SHIRLEY BRETT & ANNA,,4026 FM 1878,,NACOGDOCHES,TX,75961,0808,280,00,01,36,50,,,,,,,,,False,,FM 1878,,NAC COUNTY,TX,,,0814,005,False,False,D1T,,,,1.000000,0,0.00,,,,29.3600,A-5 A ARRIOLA P 7-1,,,,,,,,,,0,0,126840,0,0,5340,0,0,126840,5340,0,0,0,0,0,0,0,0,0,0,0,0,0,False,0,False,False,0,0,0
2021,00,NACOGDOCHES CAD,313,01-005-0020-030000,1,289,R,BROWN RICKY,,1374 COUNTY ROAD 220,,NACOGDOCHES,TX,75961,7301,280,00,01,36,50,,,,,,,,,False,,COUNTY ROAD 220,,NAC COUNTY,TX,,,1014,005,False,False,D1M,,,,1.000000,0,0.00,,,,35.9800,A-5 A ARRIOLA P-20-3,,,,,,,,,,0,0,207240,3600,0,0,0,0,207240,3600,0,0,0,0,0,0,0,0,0,0,0,0,0,False,0,False,False,0,0,0
2021,00,NACOGDOCHES CAD,333,01-005-0035-030000,1,41132,R,HENSON DUSTIN BAKER,,4117 COUNTY ROAD 302,,NACOGDOCHES,TX,75961,7910,280,00,01,36,50,,,,,,,,,False,4117,COUNTY ROAD 302,,NAC COUNTY,TX,,,1014,005,False,False,A1,,,HENSON HOUSE MOVING,1.000000,0,0.00,H,,,3.0300,A-5 A ARRIOLA P-35-3,,,,,,,,,,21820,0,0,0,0,0,0,0,141330,141330,0,0,0,0,0,0,0,0,0,119510,0,0,0,False,0,False,False,0,0,0
2021,00,NACOGDOCHES CAD,349,01-005-0050-000000,1,83738,R,GONZALEZ OMAR A & YADIRA CUARENTA,,115 COUNTY ROAD 804,,NACOGDOCHES,TX,75964,,280,00,01,36,50,,,,,,,,,False,3821,COUNTY ROAD 302,,NAC COUNTY,TX,,,1014,005,False,False,A1,,,,1.000000,0,0.00,,,,1.3200,A-5 A ARRIOLA P-50,,,,,,,,,,19010,0,0,0,0,0,0,0,96390,96390,0,0,0,0,0,0,0,0,0,77380,0,0,0,False,0,False,False,0,0,0
2021,00,NACOGDOCHES CAD,360,01-006-0004-000001,1,37126,R,SLOANE BARBARA,,1323 N FREDONIA ST,,NACOGDOCHES,TX,75961,4022,200,00,01,30,50,,65,,,,,,,False,1715,COUNTY ROAD 816,,NAC COUNTY,TX,,,0610,006,False,False,E1,,,,1.000000,0,0.00,,,,0.0000,IMPROVEMENTS ONLY,,,,,,,,,,0,0,0,0,0,0,0,0,53800,53800,0,0,0,0,0,0,0,0,0,53800,0,0,0,False,0,False,False,0,0,0
2021,00,NACOGDOCHES CAD,384,01-006-0019-010000,1,351,R,LILLY STEVE ESTATE,C/O GLENDA LILLY,PO BOX 631026,,NACOGDOCHES,TX,75963,1026,200,00,01,30,50,,65,,,,,,,False,11872,US HIGHWAY 259,,NAC COUNTY,TX,,,0612,006,False,False,D1A,D2,,,1.000000,0,0.00,,,,20.3000,A-6 H BAILEY P 19-1,A-35 J YANCY P 86,LILLY AUCTION BARN,,,,,,,,0,0,146650,2030,0,0,0,0,168960,24340,0,0,0,0,0,0,0,0,0,0,0,22310,0,False,0,False,False,0,0,0
2021,00,NACOGDOCHES CAD,430,01-006-0042-000000,1,47939,R,MCMILLAN DOROTHY E LIVING TRUST,DOROTHY E MCMILLAN TRUSTEE,491 COUNTY ROAD 812,,NACOGDOCHES,TX,75964,2826,200,00,01,30,50,,65,,,,,,,False,491,COUNTY ROAD 812,,NAC COUNTY,TX,,,0612,006,False,False,D1A,E1,,,1.000000,0,0.00,H,,,20.6500,A-6 H BAILEY P-42,,,,,,,,,,8060,0,124500,1970,0,0,0,0,430830,308300,0,0,0,0,0,0,0,0,0,298270,0,0,0,False,0,False,False,0,0,0
2021,00,NACOGDOCHES CAD,437,01-006-0046-010000,1,71018,R,MOONSHINE RENTALS,,1320 N UNIVERSITY DR,,NACOGDOCHES,TX,75961,,200,00,01,30,50,,65,,,,,,,False,3653,COUNTY ROAD 106,,NAC COUNTY,TX,,,0612,006,False,False,A1,,,,1.000000,0,0.00,,,,2.7500,A-6 H BAILEY P-46-1,,,,,,,,,,39600,0,0,0,0,0,0,0,204020,204020,0,0,0,0,0,0,0,0,0,164420,0,0,0,False,0,False,False,0,0,0
2021,00,NACOGDOCHES CAD,459,01-007-0001-010000,1,74753,R,RIZZO JANIS A,,705 SHALOM WAY,,NACOGDOCHES,TX,75964,,284,00,01,36,50,64,,,,,,,,False,705,SHALOM WAY,,NAC COUNTY,TX,,,1010,007,False,False,E1,,,,1.000000,0,0.00,H,,,15.9400,A-7 J DE LA BEGA P-1-1,,,,2350,,,,,,5760,86050,0,0,0,0,0,0,408970,408970,0,0,0,0,0,0,0,0,0,317160,0,0,0,False,0,False,False,0,0,0
2021,00,NACOGDOCHES CAD,462,01-007-0003-000000,1,33293,R,STANALAND ALVIN,,1112 WILLIAMSBURG DR,,NACOGDOCHES,TX,75965,,284,00,01,36,50,64,,,,,,,,False,2010,WESTVIEW DR,,NAC COUNTY,TX,,,1010,007,False,False,F1,,,ALVIN STANALAND CONSTRUCTION,1.000000,0,0.00,,,,10.1390,A-7 J DE LA BEGA P 3,A-570 L TUBBE PS 10 & 11,,(W PART OF LOT 4-J BLK 65),,,,,,,0,29200,0,0,0,0,0,0,175530,175530,0,0,0,0,0,0,0,0,0,0,0,146330,0,False,0,False,False,0,0,0
2021,00,NACOGDOCHES CAD,483,01-007-0011-120000,1,79556,R,GONZALEZ JOSE & MARIA E,,132 TRAN ST,,NACOGDOCHES,TX,75964,,284,00,01,36,50,64,,,,,,,,False,293,SANDY RIDGE RD,,NAC COUNTY,TX,,,1010,007,False,False,A2P,,,,1.000000,0,0.00,,,,1.4400,A-7 J DE LA BEGA P-11-12,12X46 HILLCREST MFG HOME,TXS0540733  - 02531226G,,,,,,,,14520,0,0,0,0,0,0,0,19650,19650,0,0,0,0,0,0,0,0,0,5130,0,0,0,False,0,False,False,0,0,0
2021,00,NACOGDOCHES CAD,491,01-007-0016-000000,1,75180,R,MENDEZ DE LA CRUZ ANGELICA MARIA,,3414 SPANISH BLUFF RD,,NACOGDOCHES,TX,75964,5628,284,00,01,36,50,64,,,,,,,,False,3414,OLD SPANISH BLUFF RD,,NAC COUNTY,TX,,,1010,007,False,False,A2,,,,1.000000,0,0.00,H,,,0.9200,A-7 J DE LA BEGA P-16,14X66 MOBILE HOME,,,,,,,,,10600,0,0,0,0,0,0,0,18570,18480,0,0,0,0,0,0,0,0,0,7970,0,0,0,False,0,False,False,0,0,0
2021,00,NACOGDOCHES CAD,494,06-306-0000-002000,1,72307,R,UPSHAW REUBEN & BONNIE,,4176 W STATE HIGHWAY 7,,NACOGDOCHES,TX,75964,,284,00,01,36,50,64,,,,,,,,False,4176,STATE HIGHWAY 7 W,,NAC COUNTY,TX,,,1010,007,False,False,A1,,,,1.000000,0,0.00,H,,,1.3660,LOT 2 KUNK FAMILY SUBD #1,,,,9500,,,,,,14750,0,0,0,0,0,0,0,106060,106060,0,0,0,0,0,0,0,0,0,91310,0,0,0,False,0,False,False,0,0,0
2021,00,NACOGDOCHES CAD,506,01-007-0025-010000,1,455,R,SILBY JOE J,,4355 W STATE HIGHWAY 7,,NACOGDOCHES,TX,75964,,284,00,01,36,50,64,,,,,,,,False,4355,STATE HIGHWAY 7 W,,NAC COUNTY,TX,,,1010,007,False,False,A1,,,,1.000000,0,0.00,H,,,0.6600,A-7 J DE LA BEGA P-25-1,,,,,,,,,,7600,0,0,0,0,0,0,0,36710,36710,0,0,0,0,0,0,0,0,0,25510,0,3600,0,False,0,False,False,0,0,0
2021,00,NACOGDOCHES CAD,517,01-007-0031-010000,1,75971,R,STRIPLING RENTALS LLC,,4536 W STATE HIGHWAY 7,,NACOGDOCHES,TX,75964,,284,00,01,36,50,64,,,,,,,,False,4840,STATE HIGHWAY 7 W,,NAC COUNTY,TX,,,1010,007,False,False,A1,,,,1.000000,0,0.00,,,,1.0000,A-7 J DE LA BEGA P-31-1,,,,,,,,,,0,11520,0,0,0,0,0,0,78190,78190,0,0,0,0,0,0,0,0,0,0,0,66670,0,False,0,False,False,0,0,0
2021,00,NACOGDOCHES CAD,522,01-007-0036-000000,1,117,R,CITY OF NACOGDOCHES,,PO BOX 635030,,NACOGDOCHES,TX,75963,5030,284,00,01,36,50,64,,,,,,,,True,,STATE HIGHWAY 7 W,,NAC COUNTY,TX,,,1010,007,False,False,XVM,,,,1.000000,0,0.00,,,,2.6000,A-7 J DE LA BEGA P-36,,,,,,,,,,0,28080,0,0,0,0,0,0,28080,0,0,0,0,0,0,0,0,0,0,0,0,0,0,False,0,False,False,0,0,0
2021,00,NACOGDOCHES CAD,536,01-007-0056-000000,1,480,R,CASTLEBERRY J M & J S LIVING,TRUST,3602 COLONY CREEK DR,,NACOGDOCHES,TX,75965,6976,284,00,01,36,50,64,,,,,,,,False,,STATE HIGHWAY 7 W,,NAC COUNTY,TX,,,1010,007,False,False,D1A,D2,,,1.000000,0,0.00,,,,116.2790,A-7 J DE LA BEGA P-56,(&P-41),,,,,,,,,0,0,418600,11630,0,0,0,0,423600,16630,0,0,0,0,0,0,0,0,0,0,0,5000,0,False,0,False,False,0,0,0
2021,00,NACOGDOCHES CAD,575,01-007-0080-000000,1,6489,R,SUTTON KURT KENNETH,G & S LUMBER CO,PO BOX 635110,,NACOGDOCHES,TX,75963,5110,284,00,01,36,50,64,,,,,,,,False,291,US HIGHWAY 59 S,,NAC COUNTY,TX,,,1212,007,False,False,F1,,,G & S LUMBER,1.000000,0,0.00,,,,24.0490,A-7 J DE LA BEGA P-80,,,,,,,,,,0,155840,0,0,0,0,0,0,313970,313970,0,0,0,0,0,0,0,0,0,0,0,158130,0,False,0,False,False,0,0,0
2021,00,NACOGDOCHES CAD,581,01-007-0092-010000,1,19479,R,HOWE PAUL & CONSTANCE,,298 COUNTY ROAD 2131,,NACOGDOCHES,TX,75965,6959,284,00,01,36,50,64,,,,,,,,False,3615,NEW PRESS RD,,NAC COUNTY,TX,,,1012,007,False,False,F1,,,CSAT,1.000000,0,0.00,,,,2.9600,A-7 J DE LA BEGA P-92-1,,,,,,,,,,0,35160,0,0,0,0,0,0,140770,140770,0,0,0,0,0,0,0,0,0,0,0,105610,0,False,0,False,False,0,0,0
2021,00,NACOGDOCHES CAD,592,01-007-0103-010000,1,117,R,CITY OF NACOGDOCHES,,PO BOX 635030,,NACOGDOCHES,TX,75963,5030,284,00,01,36,50,64,,,,,,,,True,,,,NAC COUNTY,TX,,,1212,007,False,False,XVM,,,,1.000000,0,0.00,,,,1.5800,A-7 J DE LA BEGA P-103-1,,,,,,,,,,0,18200,0,0,0,0,0,0,18200,0,0,0,0,0,0,0,0,0,0,0,0,0,0,False,0,False,False,0,0,0
2021,00,NACOGDOCHES CAD,618,01-008-0001-000000,1,117,R,CITY OF NACOGDOCHES,,PO BOX 635030,,NACOGDOCHES,TX,75963,5030,290,00,01,36,12,50,,,,,,,,True,,TERRY CRAWFORD DR,,NACOGDOCHES,TX,,,1010,008,False,False,XVM,,,,1.000000,0,0.00,,,,20.0000,A-8 LITTLE J DE LA BEGA P-1,,,,,,,,,,0,115200,0,0,0,0,0,0,115200,0,0,0,0,0,0,0,0,0,0,0,0,0,0,False,0,False,False,0,0,0
2021,00,NACOGDOCHES CAD,634,01-008-0011-010000,1,556,R,OWENS LEROY,C/O DON BECK,303 N MOUND ST,,NACOGDOCHES,TX,75961,5033,284,00,01,36,50,64,,,,,,,,False,5445,STATE HIGHWAY 7 W,,NAC COUNTY,TX,,,1010,008,False,False,A2,,,,1.000000,0,0.00,,,,0.8500,A-8 LITTLE J DE LA BEGA P-11-1,,**DALE ALLENS M/H SITS HERE**,,,,,,,,0,7200,0,0,0,0,0,0,7200,7200,0,0,0,0,0,0,0,0,0,0,0,0,0,False,0,False,False,0,0,0
2021,00,NACOGDOCHES CAD,645,01-008-0014-020000,1,117,R,CITY OF NACOGDOCHES,,PO BOX 635030,,NACOGDOCHES,TX,75963,5030,290,00,01,36,12,50,,,,,,,,True,,STATE HIGHWAY 7 W,,NACOGDOCHES,TX,,,1010,008,False,False,XVM,,,,1.000000,0,0.00,,,,0.2100,A-8 LITTLE J DE LA BEGA P-14-2,,,,,,,,,,0,3020,0,0,0,0,0,0,3020,0,0,0,0,0,0,0,0,0,0,0,0,0,0,False,0,False,False,0,0,0
2021,00,NACOGDOCHES CAD,647,01-008-0015-010000,1,560,R,ARRIOLA CEMETERY,C/O VICK ARRIOLA,,,,,,,290,00,01,36,12,50,,,,,,,,True,,STATE HIGHWAY 7 W,,NACOGDOCHES,TX,,,1010,008,False,False,XVZ,,,,1.000000,0,0.00,,,,0.9400,A-8 LITTLE J DE LA BEGA P-15-1,ARRIOLA COOK CEMETERY,,,,,,,,,0,11890,0,0,0,0,0,0,11890,0,0,0,0,0,0,0,0,0,0,0,0,0,0,False,0,False,False,0,0,0
2021,00,NACOGDOCHES CAD,649,01-008-0017-000000,10,73625,R,WHITAKER ALTON,,4524 FOREST RIDGE DR,,NACOGDOCHES,TX,75965,,284,00,01,36,50,64,,,,,,,,False,,COUNTY ROAD 715,,NAC COUNTY,TX,,,1010,008,False,False,D1T,,,,0.027000,0,0.00,,,,0.2473,A-8 LITTLE J DE LA BEGA P-17,,,,,,,,,,0,0,1180,0,0,50,0,0,1180,50,0,0,0,0,0,0,0,0,0,0,0,0,0,False,0,False,False,0,0,0
2021,00,NACOGDOCHES CAD,666,01-008-0027-010000,1,573,R,MONTES CHARLES L & MARSHA,,353 COUNTY ROAD 615,,NACOGDOCHES,TX,75964,7641,284,00,01,36,50,64,,,,,,,,False,353,COUNTY ROAD 615,,NAC COUNTY,TX,,,1210,008,False,False,D1A,E1,D2,,1.000000,0,0.00,H,,,8.8800,A-8 LITTLE J DE LA BEGA P-27-1,,,,,,,,,,8640,0,68080,790,0,0,0,0,296810,229520,0,0,0,0,0,0,0,0,0,199500,0,20590,0,False,0,False,False,0,0,0
2021,00,NACOGDOCHES CAD,690,01-008-0037-040000,1,78575,R,OSGOOD STEVEN L JR,,3600 N WEST AVE  LOT 20,,EL DORADO,AR,71730,2616,284,00,01,36,50,64,,,,,,,,False,,F R LEWIS RD,,NAC COUNTY,TX,,,1210,008,False,False,D1T,,,,1.000000,0,0.00,,,,5.0000,A-8 LITTLE J DE LA BEGA P-37-4,,,,,,,,,,0,0,32400,0,0,910,0,0,32400,910,0,0,0,0,0,0,0,0,0,0,0,0,0,False,0,False,False,0,0,0
2021,00,NACOGDOCHES CAD,695,01-008-0037-100000,1,73413,R,LKDS INVESTMENTS,,3900 S MEDFORD DR,,LUFKIN,TX,75901,5754,284,00,01,36,50,64,,,,,,,,False,200,WINDY PINES DR,,NAC COUNTY,TX,,,1210,008,False,False,D1T,,,,1.000000,0,0.00,,,,11.0120,A-8 LITTLE J DE LA BEGA,P 37-10,,,,,,,,,0,0,44400,0,0,2000,0,0,44400,2000,0,0,0,0,0,0,0,0,0,0,0,0,0,False,0,False,False,0,0,0
2021,00,NACOGDOCHES CAD,730,01-009-0011-000000,1,628,R,FEARS DORIS,,5134 TAVENOR LN,,HOUSTON,TX,77048,2646,210,00,01,31,50,62,,,,,,,,False,,COUNTY ROAD 935,,NAC COUNTY,TX,,,0408,009,False,False,D1A,,,,1.000000,0,0.00,,,,54.8700,A-9 Z BENNETT P-11,,,,,,,,,,0,0,189630,5490,0,0,0,0,189630,5490,0,0,0,0,0,0,0,0,0,0,0,0,0,False,0,False,False,0,0,0
2021,00,NACOGDOCHES CAD,748,01-009-0020-040000,1,640,R,KROLL JAMES C,,6747 STATE HIGHWAY 204,,NACOGDOCHES,TX,75964,,210,00,01,31,50,62,,,,,,,,False,6747,STATE HIGHWAY 204,,NAC COUNTY,TX,,,0408,009,False,False,A1,,,,1.000000,0,0.00,H,,,0.7400,A-9 Z BENNETT P 20-4,,,,,,,,,,10660,0,0,0,0,0,0,0,106400,106400,0,0,0,0,0,0,0,0,0,95740,0,0,0,False,0,False,False,0,0,0
2021,00,NACOGDOCHES CAD,755,01-009-0022-000001,1,1329,R,ROGERS WILLIAM E,,1810 COUNTY ROAD 929,,NACOGDOCHES,TX,75964,,210,00,01,31,50,62,,,,,,,,False,,COUNTY ROAD 838,,NAC COUNTY,TX,,,0408,009,False,False,E,,,,1.000000,0,0.00,,,,7.3500,A-9 Z BENNETT P-22,,,,,,,,,,0,33870,0,0,0,0,0,0,33870,33870,0,0,0,0,0,0,0,0,0,0,0,0,0,False,0,False,False,0,0,0
2021,00,NACOGDOCHES CAD,756,01-009-0023-000000,14,63488,R,DAY WILLIAM H,,1896 E DESERT ISLAND DR,,FRESNO,CA,93730,3407,210,00,01,31,50,62,,,,,,,,False,,COUNTY ROAD 838,,NAC COUNTY,TX,,,0408,009,False,False,D1T,,,,0.200000,0,0.00,,,,8.2260,A-9 Z BENNETT P-23,,,,,,,,,,0,0,28430,0,0,1500,0,0,28430,1500,0,0,0,0,0,0,0,0,0,0,0,0,0,False,0,False,False,0,0,0
2021,00,NACOGDOCHES CAD,756,01-009-0023-000000,25,63487,R,DAY HOYLE G,ZANDRA E DAY,563 PRINCESS PL,,TYLER,TX,75704,6647,210,00,01,31,50,62,,,,,,,,False,,COUNTY ROAD 838,,NAC COUNTY,TX,,,0408,009,False,False,D1T,,,,0.016700,0,0.00,,,,0.6869,A-9 Z BENNETT P-23,,,,,,,,,,0,0,2370,0,0,130,0,0,2370,130,0,0,0,0,0,0,0,0,0,0,0,0,0,False,0,False,False,0,0,0
2021,00,NACOGDOCHES CAD,757,01-009-0024-000000,1,82662,R,GEN 2 PROPERTIES LLC,,PO BOX 246,,SHELBYVILLE,TX,75973,,210,00,01,31,50,62,,,,,,,,False,,COUNTY ROAD 838,,NAC COUNTY,TX,,,0408,009,False,False,D1T,,,,1.000000,0,0.00,,,,36.1000,A-9 Z BENNETT P-24,,,,,,,,,,0,0,103970,0,0,10250,0,0,103970,10250,0,0,0,0,0,0,0,0,0,0,0,0,0,False,0,False,False,0,0,0